EnvThes
type: ConceptScheme

deprecated concept
type: Concept

species list
type: Concept
in scheme: EnvThes
note: [controlled by ] U Grandin, 2013-08-22
definition: A compilation of all found species in a given area or ecosystem
broader: deprecated concept
deprecated: true