EnvThes
type: ConceptScheme

deprecated concept
type: Concept

BBCH-scale
type: Concept
in scheme: EnvThes
definition: [Wikipedia] The BBCH-scale is a scale used to identify the phenological development stages of a plant
broader: deprecated concept
deprecated: true