EnvThes
type: ConceptScheme

absorption
type: Concept
in scheme: EnvThes
definition: div id=\\"formula-bar\\"\ \ div id=\\"t-formula-bar-input-container\\"\ \ div dir=\\"ltr\\"\ \ div id=\\"t-formula-bar-input\\"\ \ div class=\\"cell-input\\" dir=\\"ltr\\"[NASA] The process in which radiant energy is retained by a substance. A further process always results from absorption, that is, the irreversible conversion of the absorbed radiation into some other form of energy within and according to the nature of the absorbing medium. The absorbing medium itself may emit radiation, but only after an energy conversion has occurred./div\ \ div /div\ \ /div\ \ /div\ \ /div\ \ /div
broader: biogeochemical process
preferred label: απορρόφηση @el
creator: https://orcid.org/0000-0003-2195-3997

biogeochemical process
type: Concept
narrower: absorption