EnvThes
type: ConceptScheme

suspended solids
type: Concept
in scheme: EnvThes
alternative label: amount of suspended soilds in water
scope note: US LTER controlled vocabulary
definition: Suspended solids refers to small solid particles which remain in suspension in water as a colloid or due to the motion of the water.
broader: variable
modified: 2019-06-12

variable
type: Concept
narrower: suspended solids