EnvThes
type: ConceptScheme

root density
type: Concept
in scheme: EnvThes
alternative label: root length density
alternative label: density of roots
definition: [CO_338][CO_339] The length of roots present in a unit volume of soil
broader: variable

variable
type: Concept
narrower: root density