EnvThes
type: ConceptScheme

respiration rate
type: Concept
in scheme: EnvThes
alternative label: rate of respiration
scope note: US LTER controlled vocabulary
definition: [TO] The total amount of carbon lost metabolically by the plant per unit time and is measured by determining the increase in CO2 concentration over a plant leaf in a glass enclosure.
broader: variable
modified: 2019-06-12

variable
type: Concept
narrower: respiration rate