EnvThes
type: ConceptScheme

inorganic nutrient content
type: Concept
in scheme: EnvThes
scope note: US LTER controlled vocabulary
definition: Inorganic nutrients are chemical elements, compounds, and other substances that an organism needs to live and grow or a substance used in an organism's metabolism that are not chemically carbon-based.
broader: variable

variable
type: Concept
narrower: inorganic nutrient content