EnvThes
type: ConceptScheme

emergence date
type: Concept
in scheme: EnvThes
alternative label: date of emergence from dormancy
definition: [Wikipedia] Dormancy is a period in an organism's life cycle when growth, development, and (in animals) physical activity are temporarily stopped.
broader: variable

variable
type: Concept
narrower: emergence date