EnvThes
type: ConceptScheme

birth date
type: Concept
in scheme: EnvThes
alternative label: date of birth
definition: [EFO] The point in time at which an individual was born.
broader: variable

variable
type: Concept
narrower: birth date