EnvThes
type: ConceptScheme

canopy aerodynamic resistance
type: Concept
in scheme: EnvThes
alternative label: aerodynamic resistance of canopy
alternative label: aerodynamic resistance
definition: The transfer of heat and water vapour from the evaporating surface into the air above the canopy.
broader: variable

variable
type: Concept
narrower: canopy aerodynamic resistance