EnvThes
type: ConceptScheme

dissolved organic carbon in soil
type: Concept
in scheme: EnvThes
narrow match: http://onto.nerc.ac.uk/GBASEvocabulary/205
narrow match: http://onto.nerc.ac.uk/CAST/19
contributor: kath
alternative label: amount of dissolved organic carbon in soil
alternative label: DOC in soil
definition: [GEMET] The fraction of total organic carbon (all carbon atoms covalently bonded in organic molecules) in water that passes through a 0.45 micron pore-diameter filter
broader: variable

variable
type: Concept
narrower: dissolved organic carbon in soil