EnvThes
type: ConceptScheme

life history characteristic
type: Concept
in scheme: EnvThes
definition: [MESH] Morphological or behavioral traits influenced by various living conditions that a population encounters especially as it pertains to REPRODUCTION and survival of the population (see POPULATION DYNAMICS) such as age at first reproductive event, number and size of offspring, and lifespan.
broader: characteristic
creator: https://orcid.org/0000-0003-2195-3997

characteristic
type: Concept
narrower: life history characteristic