EnvThes
type: ConceptScheme

understory vegetation
type: Concept
in scheme: EnvThes
note: [controlled by ] U Grandin, 2013-04-23
scope note: US LTER controlled vocabulary
definition: [Henderson's] n. vegetation layer between tree canopy and the ground cover in a forest or wood. It is composed of shrubs and small trees.
broader: vegetation type
modified: 2019-06-12

vegetation type
type: Concept
narrower: understory vegetation