EnvThes
type: ConceptScheme

environmental impact
type: Concept
in scheme: EnvThes
scope note: MS Academic Keywords
definition: [GEMET] Any alteration of environmental conditions or creation of a new set of environmental conditions, adverse or beneficial, caused or induced by the action or set of actions under consideration.
broader: environmental science
creator: https://orcid.org/0000-0003-2195-3997

environmental science
type: Concept
narrower: environmental impact