EnvThes
type: ConceptScheme

environmental impact assessment
type: Concept
in scheme: EnvThes
alternative label: EIA
scope note: MS Academic Keywords
definition: [GEMET] Analysis and judgement of the effects upon the environment, both temporary and permanent, of a significant development or project. It must also consider the social consequences and alternative actions.
broader: environmental assessment
creator: https://orcid.org/0000-0003-2195-3997

environmental assessment
type: Concept
narrower: environmental impact assessment