EnvThes
type: ConceptScheme

deprecated concept
type: Concept

gene diversity
type: Concept
in scheme: EnvThes
alternative label: genetic diversity
scope note: MS Academic Keywords
definition: [NCIT] Genetic Variation consists of deviation(s) in the nucleotide sequence of the genetic material of an individual from that typical of the group to which the individual belongs, or deviation(s) in the nucleotide sequence of the genetic material of offspring from that of its parents.
broader: deprecated concept
deprecated: true
creator: https://orcid.org/0000-0003-2195-3997