EnvThes
type: ConceptScheme

silviculture
type: Concept
preferred label: selvicultura @it
preferred label: 造林 @ja
preferred label: 造林学 @zh
broader: management
definition: [Henderson's] n. the cultivation of trees and management of forests and woodland for timber.
scope note: US LTER controlled vocabulary
contributor: 0000-0002-7997-219X
in scheme: EnvThes

management
type: Concept
narrower: silviculture