EnvThes
type: ConceptScheme

seasonality
type: Concept
in scheme: EnvThes
scope note: US LTER controlled vocabulary
definition: the fact that something changes according to the time of the year
broader: characteristic
modified: 2019-06-12

characteristic
type: Concept
narrower: seasonality