EnvThes
type: ConceptScheme

porosity
type: Concept
in scheme: EnvThes
note: [controlled by ] Lars Lundin 20130611
scope note: US LTER controlled vocabulary
definition: Void spaces in a material, and is a fraction of the volume of voids over the total matrix volume
broader: derived property
modified: 2019-06-12

derived property
type: Concept
narrower: porosity