EnvThes
type: ConceptScheme

height
type: Concept
in scheme: EnvThes
note: [controlled by ] U Grandin, 2013-08-22
definition: The height of a species, or the (estimated) mean height of a plant community
broader: observable property

observable property
type: Concept
narrower: height