EnvThes
type: ConceptScheme

absorbed dose
type: Concept
in scheme: EnvThes
alternative label: L2T-2
definition: [STUFF] Absorbed dose is the energy deposited in a medium by ionizing radiation. It is a derived quantity in the International System of Units. Absorbed dose is energy divided by mass.
broader: derived property

derived property
type: Concept
narrower: absorbed dose