EnvThes
type: ConceptScheme

length
type: Concept
in scheme: EnvThes
alternative label: L
definition: [ECSO]* The linear extent in space from one end to the other; the longest dimension of something that is fixed in place
broader: observable property
preferred label: 长度 @zh
preferred label: 長さ @ja

observable property
type: Concept
narrower: length