EnvThes
type: ConceptScheme

composition
type: Concept
in scheme: EnvThes
definition: [ NCIT ][ ENM ]* The way in which something is made, especially in terms of its different parts; its constituents.
broader: derived property
creator: https://orcid.org/0000-0003-2195-3997

derived property
type: Concept
narrower: composition