EnvThes
type: ConceptScheme

environmental quality
type: Concept
in scheme: EnvThes
scope note: MS Academic Keywords
definition: [GEMET] Properties and characteristics of the environment, either generalized or local, as they impinge on human beings and other organisms. Environmental quality is a general term which can refer to: varied characteristics such as air and water purity or pollution, noise, access to open space, and the visual effects of buildings, and the potential effects which such characteristics may have on physical and mental health.
broader: characteristic
creator: https://orcid.org/0000-0003-2195-3997

characteristic
type: Concept
narrower: environmental quality