EnvThes
type: ConceptScheme

redox
type: Concept
in scheme: EnvThes
note: [controlled by ] Staszewski 08.06.2013
scope note: US LTER controlled vocabulary
definition: [Henderson's] a. pert. mutual oxidation and reduction.
broader: observable property
modified: 2019-06-12

observable property
type: Concept
narrower: redox