EnvThes
type: ConceptScheme

isolation
type: Concept
in scheme: EnvThes
scope note: LTER EU controlled vocabulary
definition: [Henderson's] n. prevention of mating between breeding groups owing to spatial, topo­graphical, ecological, morphological, phy­siological, genetic, behavioural or other factors.
broader: characteristic

characteristic
type: Concept
narrower: isolation