EnvThes
type: ConceptScheme

cell size
type: Concept
in scheme: EnvThes
scope note: MS Academic Keywords
definition: [CRISP] the physical dimensions of a cell; may refer to changes in dimensions correlated with physiological or pathological changes in cells.
broader: variable
creator: https://orcid.org/0000-0003-2195-3997

variable
type: Concept
narrower: cell size