EnvThes
type: ConceptScheme

deprecated concept
type: Concept

carbon-to-nitrogen ratio
type: Concept
in scheme: EnvThes
alternative label: carbon to nitrogen ratio
definition: The C/N ratio (C:N) or carbon-to-nitrogen ratio is a ratio of the mass of carbon to the mass of nitrogen in a substance. Carbon-to-nitrogen ratios are an indicator for nitrogen limitation of plants and other organisms.
broader: deprecated concept
deprecated: true
modified: 2020-02-11