EnvThes
type: ConceptScheme

heavy metal deposition
type: Concept
in scheme: EnvThes
definition: A metal whose specific gravity is approximately 5.0 or higher.
broader: biogeochemical process

biogeochemical process
type: Concept
narrower: heavy metal deposition