EnvThes
type: ConceptScheme

bacterial production
type: Concept
in scheme: EnvThes
scope note: US LTER controlled vocabulary
definition: [Henderson's, modified] the assimilation and ﬁxation of carbon by bacteria
broader: biological process
modified: 2019-06-12

biological process
type: Concept
narrower: bacterial production