EnvThes
type: ConceptScheme

life history evolution
type: Concept
in scheme: EnvThes
scope note: MS Academic Keywords
definition: [Jukka Jokela] Life-history evolution is a complex process. Life-history theory covers the fundamental level of the process, the evolution of life-history traits.
broader: biological process
creator: https://orcid.org/0000-0003-2195-3997

biological process
type: Concept
narrower: life history evolution