EnvThes
type: ConceptScheme

exotic species
type: Concept
in scheme: EnvThes
scope note: MS Academic Keywords
definition: [GEMET] Plants, animals or microorganisms which are introduced by humans into areas where they are not native. Exotics are often associated with negative ecological consequences for native species and the ecosystems.
broader: species
creator: https://orcid.org/0000-0003-2195-3997

species
type: Concept
preferred label: أنواع @ar
preferred label: Видове @bg
preferred label: είδος @el
preferred label: vrsta @sl
preferred label: sugas @lv
preferred label: specie @ro
preferred label: soort @nl
preferred label: Art (Spezies) @de
preferred label: art @da
preferred label: art (biologi) @no
preferred label: arter @sv
preferred label: druh @cs
preferred label: especies @es
preferred label: espèce @fr
preferred label: espécies @pt
preferred label: faj @hu
preferred label: gatunek @pl
preferred label: laji @fi
preferred label: liik (biol) @et
preferred label: rūšys @lt
narrower: exotic species