EnvThes
type: ConceptScheme

herbivore
type: Concept
in scheme: EnvThes
scope note: US LTER controlled vocabulary
definition: [Henderson's] n. animal that feeds exclusively on plants. a. herbivorous.
broader: food web
modified: 2019-06-12

food web
type: Concept
narrower: herbivore