EnvThes
type: ConceptScheme

shrews
type: Concept
in scheme: EnvThes
scope note: US LTER controlled vocabulary
definition: A shrew or shrew mouse (family Soricidae) is a small mole-like mammal classified in the order Soricomorpha. True shrews are also not to be confused with West Indies shrews, treeshrews, otter shrews, or elephant shrews, which belong to different families or orders.Although its external appearance is generally that of a long-nosed mouse, a shrew is not a rodent, as mice are, and is in fact more closely related to moles. Shrews have sharp, spike-like teeth, not the familiar gnawing front incisor teeth of rodents.Shrews are distributed almost worldwide: of the major tropical and temperate land masses, only New Guinea, Australia, and New Zealand do not have any native shrews; in South America, shrews are relatively recent immigrants and are present only in the northern Andes. In terms of species diversity, the shrew family is the fourth most successful mammal family, being rivalled only by the muroid rodent families Muridae and Cricetidae and the bat family Vespertilionidae. [DBPedia]
broader: animals

animals
type: Concept
preferred label: 動物 @ja
preferred label: 动物 @zh
narrower: shrews