EnvThes
type: ConceptScheme

slugs
type: Concept
in scheme: EnvThes
scope note: US LTER controlled vocabulary
definition: [Henderson's] n. (1) shell-less terrestrial gastropod mollusc; (2) migrating pseudoplasmodium of a cellular slime mould.
broader: animals

animals
type: Concept
preferred label: 動物 @ja
preferred label: 动物 @zh
narrower: slugs