EnvThes
type: ConceptScheme

crabs
type: Concept
in scheme: EnvThes
note: [controlled by ] Mark Frenzel, 22 May 2013" , "[source of definition ] http://en.wikipedia.org/wiki/Crab
scope note: US LTER controlled vocabulary
definition: Crabs are decapod crustaceans living in any of the world's oceans, in fresh water, or on land, generally covered with a thick exoskeleton and armed with a single pair of claws. True crabs belong to the infraorder Brachyura, which typically have a very short projecting tail, or where the reduced abdomen is entirely hidden under the thorax. Many other animals with similar names – such as hermit crabs, king crabs, porcelain crabs, horseshoe crabs and crab lice – are not true crabs.
broader: animals
modified: 2019-06-12

animals
type: Concept
preferred label: 動物 @ja
preferred label: 动物 @zh
narrower: crabs