EnvThes
type: ConceptScheme

hoverflies
type: Concept
in scheme: EnvThes
scope note: LTER EU controlled vocabulary
definition: [Wikipedia] Hoverflies are flies (Diptera) belonging the family of Syrphidae.
broader: animals

animals
type: Concept
preferred label: 動物 @ja
preferred label: 动物 @zh
narrower: hoverflies