EnvThes
type: ConceptScheme

biological marker
type: Concept
in scheme: EnvThes
scope note: MS Academic Keywords
definition: [NCIT] A characteristic that can be objectively measured and serves as an indicator for normal biologic processes, pathogenic processes, state of health or disease, the risk for disease development and/or prognosis, or responsiveness to a particular therapeutic intervention.
broader: device
creator: https://orcid.org/0000-0003-2195-3997

device
type: Concept
narrower: biological marker