EnvThes
type: ConceptScheme

piezometer
type: Concept
in scheme: EnvThes
definition: [SWEET] A devise used to measure groundwater pressure head at a point in the subsurface.
broader: device

device
type: Concept
narrower: piezometer