EnvThes
type: ConceptScheme

thermocouple
type: Concept
in scheme: EnvThes
definition: [CHMO] A piece of apparatus that generates electrical current when it experiences a thermal gradient.
broader: device

device
type: Concept
narrower: thermocouple