EnvThes
type: ConceptScheme

biological effect
type: Concept
in scheme: EnvThes
scope note: MS Academic Keywords
definition: [GEMET] Biological effects include allergic reactions, respiratory disorders, hypersensitivity diseases and infectious diseases and can be caused by a variety of contaminants and pollutants.
broader: management practice
creator: https://orcid.org/0000-0003-2195-3997

management practice
type: Concept
narrower: biological effect