EnvThes
type: ConceptScheme

counting of individuals
type: Concept
in scheme: EnvThes
note: [controlled by ] Giorgio Matteucci , 23/05/2013" , "[source of definition ] Expert
definition: Counting of individuals of species of plants or animals. Sampling method that involves counting individuals on a certain area
broader: sampling method

sampling method
type: Concept
narrower: counting of individuals