EnvThes
type: ConceptScheme

turbidity
type: Concept
in scheme: EnvThes
definition: [HUPSON] Turbidity is the cloudiness or haziness of a fluid caused by individual particles (suspended solids) that are generally invisible to the naked eye, similar to smoke in air. The measurement of turbidity is a key test of water quality. Fluids can contain suspended solid matter consisting of particles of many different sizes. While some suspended material will be large enough and heavy enough to settle rapidly to the bottom of the container if a liquid sample is left to stand (the settable solids), very small particles will settle only very slowly or not at all if the sample is regularly agitated or the particles are colloidal. These small solid particles cause the liquid to appear turbid. Turbidity (or haze) is also applied to transparent solids such as glass or plastic. In plastic production haze is defined as the percentage of light that is deflected more than 2.5 deg from the incoming light direction.[1] source: http://en.wikipedia.org/wiki/Turbidity
broader: observable property
creator: https://orcid.org/0000-0003-2195-3997

observable property
type: Concept
narrower: turbidity