EnvThes
type: ConceptScheme

heterogeneity
type: Concept
in scheme: EnvThes
definition: [NCIT] The quality or state of consisting of elements that are not of the same kind or nature.
broader: derived property
creator: https://orcid.org/0000-0003-2195-3997

derived property
type: Concept
narrower: heterogeneity