EnvThes
type: ConceptScheme

intensity
type: Concept
in scheme: EnvThes
definition: [SIO] intensity is a quality that represents the strength or degree of something.
broader: observable property
creator: https://orcid.org/0000-0003-2195-3997

observable property
type: Concept
narrower: intensity