EnvThes
type: ConceptScheme

deprecated concept
type: Concept

duplicated concepts
type: Concept
in scheme: EnvThes
editorial note: concept for internal organization
definition: container for concepts, which by error have been created twice or more times.
broader: deprecated concept
deprecated: true