EnvThes
type: ConceptScheme

evaporation
type: Concept
in scheme: EnvThes
definition: [ENVO] Evaporation is a form of vaporisation which occurs when a portion of the surface layer of a liquid in contact with a gaseous material, which is not saturated with the evaporating substance, vaporises. [database_cross_reference: Adapted from Wikipedia:Evaporation]
broader: observable property
preferred label: التبخر @ar
preferred label: Изпарение @bg
preferred label: εξάτμιση @el
preferred label: výpar @cs
preferred label: verdamping @nl
preferred label: parowanie @pl
preferred label: iztvaicēšana; iztvaikošana @lv
preferred label: izhlapevanje, evaporacija @sl
preferred label: évaporation @fr
preferred label: Evaporation @de
preferred label: aurumine @et
preferred label: avdunstning @sv
preferred label: evaporación @es
preferred label: evaporare @ro
preferred label: evaporazione @it
preferred label: evaporação @pt
preferred label: evaporácia @sk
preferred label: evaporáció @hu
preferred label: fordampning @da
preferred label: garavimas @lt
preferred label: haihtuminen @fi
preferred label: ishlapljivanje @hr

observable property
type: Concept
narrower: evaporation