EnvThes
type: ConceptScheme

deprecated concept
type: Concept

actinorhizal plants
type: Concept
contributor: nsb@ceh.ac.uk@ceh.ac.uk
deprecated: true
alternative label: actinorhizal
broader: deprecated concept
definition: group of angiosperms characterized by their ability to form a symbiosis with the nitrogen fixing actinobacteria Frankia , "Les plantes actinorhiziennes sont des angiospermes caractérisées par leur capacité à former des nodosités fixatrices d'azote au niveau des racines en s'associant avec des bactéries filamenteuses du sol du genre Frankia.
definition: Les plantes actinorhiziennes sont des angiospermes caractérisées par leur capacité à former des nodosités fixatrices d'azote au niveau des racines en s'associant avec des bactéries filamenteuses du sol du genre Frankia. @fr
in scheme: EnvThes
note: [comments ] Henderson definition was in French" , "[controlled by ] Neagu Stefan 07/06/13
scope note: US LTER controlled vocabulary