EnvThes
type: ConceptScheme

deprecated concept
type: Concept

water measure
type: Concept
deprecated: true
broader: deprecated concept
definition: Parameters of standing or running surface water including karst phenomenons
in scheme: EnvThes
scope note: US LTER controlled vocabulary