EnvThes
type: ConceptScheme

deprecated concept
type: Concept

chemical property
type: Concept
deprecated: true
broader: deprecated concept
definition: Any chemical compound regardless of the object of interest or matrix
in scheme: EnvThes
preferred label: propriété chimique @fr
scope note: US LTER controlled vocabulary